Target
Tissue factor
Ligand
BDBM50424061
Substrate
Meas. Tech.
ChEMBL_936735 (CHEMBL2319887)
IC50
13±n/a nM
Citation
 Ge, HXZhang, JChen, LKou, JPYu, BY Chemical and microbial semi-synthesis of tetrahydroprotoberberines as inhibitors on tissue factor procoagulant activity. Bioorg Med Chem 21:62-9 (2012)  
Target
Name:
Tissue factor
Synonyms:
CD_antigen=CD142 Coagulation factor VII/tissue factor TF Thromboplastin | Tissue factor
Type:
PROTEIN
Mol. Mass.:
33067.61
Organism:
Homo sapiens (Human)
Description:
ChEMBL_936735
Residue:
295
  
Inhibitor
Name:
BDBM50424061
Synonyms:
CHEMBL2314744
Type:
Small organic molecule
Emp. Form.:
C26H33NO9
Mol. Mass.:
503.5415
SMILES:
COc1cc2CCN3Cc4c(C[C@@H]3c2cc1OC)ccc(OC)c4O[C@@H]1O[C@H](CO)[C@@H](O)[C@H](O)[C@H]1O
: