Target
Thymidylate kinase
Ligand
BDBM50359625
Substrate
Meas. Tech.
ChEMBL_936739 (CHEMBL2319891)
Ki
170±n/a nM
Citation
 Toti, KSVerbeke, FRisseeuw, MDFrecer, VMunier-Lehmann, HVan Calenbergh, S Synthesis and evaluation of 5'-modified thymidines and 5-hydroxymethyl-2'-deoxyuridines as Mycobacterium tuberculosis thymidylate kinase inhibitors. Bioorg Med Chem 21:257-68 (2012)  
Target
Name:
Thymidylate kinase
Synonyms:
KTHY_MYCTU Thymidine monophosphate kinase tmk
Type:
PROTEIN
Mol. Mass.:
22636.29
Organism:
Mycobacterium tuberculosis
Description:
ChEMBL_208218
Residue:
214
  
Inhibitor
Name:
BDBM50359625
Synonyms:
CHEMBL1928435
Type:
Small organic molecule
Emp. Form.:
C18H18ClF3N4O3S2
Mol. Mass.:
494.939
SMILES:
Cc1cn([C@@H]2C[C@H](O)[C@@H](CNC(=S)Nc3ccc(Cl)c(c3)C(F)(F)F)O2)c(=O)[nH]c1=S
: