Target
Androgen receptor
Ligand
BDBM50359006
Substrate
Meas. Tech.
ChEMBL_933429 (CHEMBL2318841)
IC50
13100±n/a nM
Citation
 Munuganti, RSLeblanc, EAxerio-Cilies, PLabriere, CFrewin, KSingh, KHassona, MDLack, NALi, HBan, FTomlinson Guns, EYoung, RRennie, PSCherkasov, A Targeting the binding function 3 (BF3) site of the androgen receptor through virtual screening. 2. development of 2-((2-phenoxyethyl) thio)-1H-benzimidazole derivatives. J Med Chem 56:1136-48 (2013)  
Target
Name:
Androgen receptor
Synonyms:
ANDR_HUMAN Androgen Receptor Androgen receptor/Baculoviral IAP repeat-containing protein 2 Dihydrotestosterone receptor Nuclear receptor subfamily 3 group C member 4
Type:
Receptor
Mol. Mass.:
99185.27
Organism:
Homo sapiens (Human)
Description:
CHO cells were stably transfected with human AR gene.
Residue:
920
  
Inhibitor
Name:
BDBM50359006
Synonyms:
CHEMBL1738936
Type:
Small organic molecule
Emp. Form.:
C24H24N2O2S
Mol. Mass.:
404.525
SMILES:
Cc1ccc(OCCn2c(SCCOc3ccccc3)nc3ccccc23)cc1
: