Target
Low molecular weight phosphotyrosine protein phosphatase
Ligand
BDBM50425808
Substrate
Meas. Tech.
ChEMBL_937593 (CHEMBL2321062)
IC50
2900±n/a nM
Citation
 He, YXu, JYu, ZHGunawan, AMWu, LWang, LZhang, ZY Discovery and evaluation of novel inhibitors of mycobacterium protein tyrosine phosphatase B from the 6-Hydroxy-benzofuran-5-carboxylic acid scaffold. J Med Chem 56:832-42 (2013)  
Target
Name:
Low molecular weight phosphotyrosine protein phosphatase
Synonyms:
3.1.3.2 ACP1 LMW-PTP LMWPTP PPAC_HUMAN low molecular weight phosphotyrosine protein phosphatase isoform c
Type:
Mol. Mass.:
18042.81
Organism:
Homo sapiens (Human)
Description:
P24666
Residue:
158
  
Inhibitor
Name:
BDBM50425808
Synonyms:
CHEMBL2316906
Type:
Small organic molecule
Emp. Form.:
C23H12F2O4
Mol. Mass.:
390.3358
SMILES:
OC(=O)c1cc2c(C#Cc3cc(F)cc(F)c3)c(oc2cc1O)-c1ccccc1
: