Target
Adenosine receptor A2a
Ligand
BDBM50426712
Substrate
Meas. Tech.
ChEMBL_940027 (CHEMBL2327710)
EC50
1440±n/a nM
Citation
 El-Tayeb, AGollos, S Synthesis and structure-activity relationships of 2-hydrazinyladenosine derivatives as A(2A) adenosine receptor ligands. Bioorg Med Chem 21:436-47 (2012)  
Target
Name:
Adenosine receptor A2a
Synonyms:
A2A adenosine receptor (hA2A) ADENOSINE A2 ADORA2 Adenosine A2A receptor (A2AAR)
Type:
G Protein-Coupled Receptor (GPCR)
Mol. Mass.:
44716.46
Organism:
Homo sapiens (Human)
Description:
P29274
Residue:
412
  
Inhibitor
Name:
BDBM50426712
Synonyms:
CHEMBL2326831
Type:
Small organic molecule
Emp. Form.:
C16H25N7O9
Mol. Mass.:
459.4112
SMILES:
Nc1nc(NNCC(=O)[C@H](O)[C@H](O)[C@@H](O)CO)nc2n(cnc12)[C@@H]1O[C@H](CO)[C@@H](O)[C@H]1O
: