Target
Beta-secretase 1
Ligand
BDBM50427052
Substrate
Meas. Tech.
ChEMBL_940077 (CHEMBL2328011)
IC50
>100000±n/a nM
Citation
 Mok, NYChadwick, JKellett, KACasas-Arce, EHooper, NMJohnson, APFishwick, CW Discovery of biphenylacetamide-derived inhibitors of BACE1 using de novo structure-based molecular design. J Med Chem 56:1843-52 (2013)  
Target
Name:
Beta-secretase 1
Synonyms:
ASP2 Aspartyl protease 2 BACE1 Beta-secretase (BACE) Beta-secretase 1 (BACE 1) Beta-secretase 1 (BACE1) Beta-site amyloid precursor protein cleaving enzyme 1 Memapsin-2 beta-Secretase (BACE-1) | beta-Secretase (BACE1)
Type:
Protein
Mol. Mass.:
55755.10
Organism:
Homo sapiens (Human)
Description:
P56817
Residue:
501
  
Inhibitor
Name:
BDBM50427052
Synonyms:
CHEMBL2322533
Type:
Small organic molecule
Emp. Form.:
C22H22N2O2
Mol. Mass.:
346.4223
SMILES:
NCc1ccc(CNC(=O)Cc2ccc(cc2O)-c2ccccc2)cc1
: