Target
Histone-lysine N-methyltransferase EHMT2
Ligand
BDBM50427772
Substrate
Meas. Tech.
ChEMBL_941987 (CHEMBL2330207)
IC50
20000±n/a nM
Citation
 Liu, FLi, FMa, ADobrovetsky, EDong, AGao, CKorboukh, ILiu, JSmil, DBrown, PJFrye, SVArrowsmith, CHSchapira, MVedadi, MJin, J Exploiting an allosteric binding site of PRMT3 yields potent and selective inhibitors. J Med Chem 56:2110-24 (2013)  
Target
Name:
Histone-lysine N-methyltransferase EHMT2
Synonyms:
BAT8 EHMT2 G9A Histone-lysine N-methyltransferase EHMT1/EHMT2 KMT1C Protein G9a (G9a)
Type:
Enzyme
Mol. Mass.:
132339.87
Organism:
Homo sapiens (Human)
Description:
Q96KQ7
Residue:
1210
  
Inhibitor
Name:
BDBM50427772
Synonyms:
CHEMBL2325183
Type:
Small organic molecule
Emp. Form.:
C15H12N4O2S
Mol. Mass.:
312.346
SMILES:
O=C(NCC(=O)c1ccccc1)Nc1ccc2nnsc2c1
: