Target
Tumor necrosis factor
Ligand
BDBM50373071
Substrate
Meas. Tech.
ChEMBL_945952 (CHEMBL2341026)
pH
6.5±n/a
Kd
5360±n/a nM
Comments
extracted
Citation
 Papaneophytou, CPMettou, AKRinotas, VDouni, EKontopidis, GA Solvent Selection for Insoluble Ligands, a Challenge for Biological Assay Development: A TNF-?/SPD304 Study. ACS Med Chem Lett 4:137-41 (2013)  
Target
Name:
Tumor necrosis factor
Synonyms:
Cachectin TNF-a TNFA TNFSF2 Tumor necrosis factor (TNFa) Tumor necrosis factor ligand superfamily member 2 Tumor necrosis factor, soluble form | tumor necrosis factor alpha
Type:
Enzyme
Mol. Mass.:
25645.11
Organism:
Homo sapiens (Human)
Description:
P01375
Residue:
233
  
Inhibitor
Name:
BDBM50373071
Synonyms:
CHEMBL255489
Type:
Small organic molecule
Emp. Form.:
C32H32F3N3O2
Mol. Mass.:
547.6106
SMILES:
CN(CCN(C)Cc1coc2cc(C)c(C)cc2c1=O)Cc1cn(-c2cccc(c2)C(F)(F)F)c2ccccc12
: