Target
NAD-dependent protein deacetylase sirtuin-1
Ligand
BDBM31926
Substrate
Meas. Tech.
ChEMBL_948493 (CHEMBL2343194)
EC50
7000±n/a nM
Citation
 Wu, JZhang, DChen, LLi, JWang, JNing, CYu, NZhao, FChen, DChen, XChen, KJiang, HLiu, HLiu, D Discovery and mechanism study of SIRT1 activators that promote the deacetylation of fluorophore-labeled substrate. J Med Chem 56:761-80 (2013)  
Target
Name:
NAD-dependent protein deacetylase sirtuin-1
Synonyms:
NAD-Dependent Deacetylase Sirtuin-1 NAD-dependent protein deacetylase sirtuin-1 (SIRT1) SIR2-like protein 1 SIRT1 Sirtuin-1 (SIRT1) | hSIR2
Type:
Developmental protein; hydrolase
Mol. Mass.:
81626.66
Organism:
Homo sapiens (Human)
Description:
Residue:
747
  
Inhibitor
Name:
BDBM31926
Synonyms:
carbohydrazide derivative, 3i
Type:
Small organic molecule
Emp. Form.:
C14H9Br2ClN2O3
Mol. Mass.:
448.494
SMILES:
Oc1c(Br)cc(\C=N\NC(=O)c2ccc(Cl)cc2)c(O)c1Br
: