Target
NAD-dependent protein deacetylase sirtuin-2
Ligand
BDBM50428988
Substrate
Meas. Tech.
ChEMBL_948494 (CHEMBL2343195)
EC50
11600±n/a nM
Citation
 Wu, JZhang, DChen, LLi, JWang, JNing, CYu, NZhao, FChen, DChen, XChen, KJiang, HLiu, HLiu, D Discovery and mechanism study of SIRT1 activators that promote the deacetylation of fluorophore-labeled substrate. J Med Chem 56:761-80 (2013)  
Target
Name:
NAD-dependent protein deacetylase sirtuin-2
Synonyms:
NAD-Dependent Deacetylase Sirtuin-2 NAD-dependent deacetylase sirtuin 3 SIR2-like SIR2L SIR2_HUMAN Sirtuin 2 (SIRT2)
Type:
Hydrolase
Mol. Mass.:
43172.62
Organism:
Homo sapiens (Human)
Description:
Residue:
389
  
Inhibitor
Name:
BDBM50428988
Synonyms:
CHEMBL2333666
Type:
Small organic molecule
Emp. Form.:
C24H16Br2N2O3
Mol. Mass.:
540.203
SMILES:
Oc1c(Br)cc(\C=N\NC(=O)c2ccc3cc(ccc3c2)-c2ccccc2)c(O)c1Br
: