Target
Aldo-keto reductase family 1 member C2
Ligand
BDBM50429334
Substrate
Meas. Tech.
ChEMBL_948087 (CHEMBL2345593)
IC50
41200±n/a nM
Citation
 Gazvoda, MBeranic, NTurk, SBurja, BKocevar, MRižner, TLGobec, SPolanc, S 2,3-diarylpropenoic acids as selective non-steroidal inhibitors of type-5 17ß-hydroxysteroid dehydrogenase (AKR1C3). Eur J Med Chem 62:89-97 (2013)  
Target
Name:
Aldo-keto reductase family 1 member C2
Synonyms:
3-alpha-HSD3 AK1C2_HUMAN Aldo-keto reductase family 1 member C2 (AK1C2) Aldo-keto reductase family 1 member C2 (AKR1C2) DD-2 DDH2 Dihydrodiol dehydrogenase/bile acid-binding protein Type III 3-alpha-hydroxysteroid dehydrogenase
Type:
Enzyme
Mol. Mass.:
36739.89
Organism:
Homo sapiens (Human)
Description:
Residue:
323
  
Inhibitor
Name:
BDBM50429334
Synonyms:
CHEMBL2334929
Type:
Small organic molecule
Emp. Form.:
C16H14O2S
Mol. Mass.:
270.346
SMILES:
CSc1ccc(\C=C(\C(O)=O)c2ccccc2)cc1
: