Target
Aldo-keto reductase family 1 member C2
Ligand
BDBM50429336
Substrate
Meas. Tech.
ChEMBL_948087 (CHEMBL2345593)
IC50
77000±n/a nM
Citation
 Gazvoda, MBeranic, NTurk, SBurja, BKocevar, MRižner, TLGobec, SPolanc, S 2,3-diarylpropenoic acids as selective non-steroidal inhibitors of type-5 17ß-hydroxysteroid dehydrogenase (AKR1C3). Eur J Med Chem 62:89-97 (2013)  
Target
Name:
Aldo-keto reductase family 1 member C2
Synonyms:
3-alpha-HSD3 AK1C2_HUMAN Aldo-keto reductase family 1 member C2 (AK1C2) Aldo-keto reductase family 1 member C2 (AKR1C2) DD-2 DDH2 Dihydrodiol dehydrogenase/bile acid-binding protein Type III 3-alpha-hydroxysteroid dehydrogenase
Type:
Enzyme
Mol. Mass.:
36739.89
Organism:
Homo sapiens (Human)
Description:
Residue:
323
  
Inhibitor
Name:
BDBM50429336
Synonyms:
CHEMBL2334921
Type:
Small organic molecule
Emp. Form.:
C18H17FO5
Mol. Mass.:
332.323
SMILES:
COc1cc(cc(OC)c1OC)C(=C/c1cccc(F)c1)\C(O)=O
: