Target
Aldo-keto reductase family 1 member C3
Ligand
BDBM50429340
Substrate
Meas. Tech.
ChEMBL_948085 (CHEMBL2345591)
IC50
23300±n/a nM
Citation
 Gazvoda, MBeranic, NTurk, SBurja, BKocevar, MRižner, TLGobec, SPolanc, S 2,3-diarylpropenoic acids as selective non-steroidal inhibitors of type-5 17ß-hydroxysteroid dehydrogenase (AKR1C3). Eur J Med Chem 62:89-97 (2013)  
Target
Name:
Aldo-keto reductase family 1 member C3
Synonyms:
17-beta-Hydroxysteroid Dehydrogenase 5 (17-beta-HSD5, AKR1C3) AK1C3_HUMAN Aldo-keto reductase family 1 member C3 Aldo-keto reductase family 1 member C3 (AK1C3a) Aldo-keto-reductase family 1 member C3 Dihydrodiol dehydrogenase 3 Estradiol 17-beta-dehydrogenase KIAA0119 Prostaglandin F synthase Trans-1,2-dihydrobenzene-1,2-diol dehydrogenase
Type:
Enzyme
Mol. Mass.:
36859.86
Organism:
Homo sapiens (Human)
Description:
P42330
Residue:
323
  
Inhibitor
Name:
BDBM50429340
Synonyms:
CHEMBL2334913
Type:
Small organic molecule
Emp. Form.:
C17H13F3O4S
Mol. Mass.:
370.343
SMILES:
CS(=O)(=O)c1ccc(cc1)C(=C/c1ccc(cc1)C(F)(F)F)\C(O)=O
: