Target
Dihydrofolate reductase
Ligand
BDBM26519
Substrate
Meas. Tech.
ChEMBL_947629 (CHEMBL2340616)
IC50
1280±n/a nM
Citation
 Paulsen, JLViswanathan, KWright, DLAnderson, AC Structural analysis of the active sites of dihydrofolate reductase from two species of Candida uncovers ligand-induced conformational changes shared among species. Bioorg Med Chem Lett 23:1279-84 (2013)  
Target
Name:
Dihydrofolate reductase
Synonyms:
DHFR Dihydrofolate reductase (DHFR) | Tetrahydrofolate dehydrogenase
Type:
Enzyme
Mol. Mass.:
21453.99
Organism:
Homo sapiens (Human)
Description:
Recombinant human DHFR.
Residue:
187
  
Inhibitor
Name:
BDBM26519
Synonyms:
5-[3-(2,5-dimethoxyphenyl)prop-1-yn-1-yl]-6-ethylpyrimidine-2,4-diamine Propargyl-linked, 11
Type:
Small organic molecule
Emp. Form.:
C17H20N4O2
Mol. Mass.:
312.3663
SMILES:
CCc1nc(N)nc(N)c1C#CCc1cc(OC)ccc1OC
: