Target
Calcitonin gene-related peptide type 1 receptor
Ligand
BDBM50430063
Substrate
Meas. Tech.
ChEMBL_949161 (CHEMBL2344728)
Ki
0.140000±n/a nM
Citation
 Han, XCiviello, RLConway, CMCook, DADavis, CDDegnan, APJiang, XJMacci, RMathias, NRMoench, PPin, SSSchartman, RSignor, LJThalody, GTora, GWhiterock, VXu, CMacor, JEDubowchik, GM The synthesis and SAR of calcitonin gene-related peptide (CGRP) receptor antagonists derived from tyrosine surrogates. Part 2. Bioorg Med Chem Lett 23:1870-3 (2013)  
Target
Name:
Calcitonin gene-related peptide type 1 receptor
Synonyms:
Adrenomedullin receptor AM1; CALCRL/RAMP2 CALRL_HUMAN CGRP type 1 receptor mRNA Calcitonin gene-related peptide (CGRP) receptor Calcitonin receptor-like receptor Human CL receptor
Type:
Enzyme Catalytic Domain
Mol. Mass.:
52980.45
Organism:
Homo sapiens (Human)
Description:
Q16602
Residue:
461
  
Inhibitor
Name:
BDBM50430063
Synonyms:
CHEMBL2336412
Type:
Small organic molecule
Emp. Form.:
C34H42BrN7O5
Mol. Mass.:
708.645
SMILES:
Brc1cc2[nH]c(=O)oc2cc1C[C@@H](NC(=O)N1CCC(CC1)N1Cc2ccccc2NC1=O)C(=O)N1CCC(CC1)N1CCCCC1
: