Target
Mu-type opioid receptor
Ligand
BDBM50430802
Substrate
Meas. Tech.
ChEMBL_943432 (CHEMBL2341876)
IC50
0.962000±n/a nM
Citation
 Liu, XWang, YXing, YYu, JJi, HKai, MWang, ZWang, DZhang, YZhao, DWang, R Design, synthesis, and pharmacological characterization of novel endomorphin-1 analogues as extremely potentµ-opioid agonists. J Med Chem 56:3102-14 (2013)  
Target
Name:
Mu-type opioid receptor
Synonyms:
M-OR-1 Mor OPRM_MOUSE Oprm | Oprm1
Type:
Enzyme Catalytic Domain
Mol. Mass.:
44431.62
Organism:
MOUSE
Description:
OPIATE Mu OPRM1 MOUSE::P42866
Residue:
398
  
Inhibitor
Name:
BDBM50430802
Synonyms:
CHEMBL2334775
Type:
Small organic molecule
Emp. Form.:
C35H40N6O6
Mol. Mass.:
640.7287
SMILES:
Cc1cc(O)cc(C)c1C[C@H](N)C(=O)N1CC[C@@H](C1)C(=O)N[C@@H](Cc1c[nH]c2ccccc12)C(=O)N[C@H](C(=C)C(N)=O)c1ccco1
: