Target
D-amino-acid oxidase
Ligand
BDBM50260725
Substrate
Meas. Tech.
ChEMBL_947859 (CHEMBL2343135)
IC50
1.4±n/a nM
Citation
 Hondo, TWarizaya, MNiimi, TNamatame, IYamaguchi, TNakanishi, KHamajima, THarada, KSakashita, HMatsumoto, YOrita, MTakeuchi, M 4-Hydroxypyridazin-3(2H)-one derivatives as novel D-amino acid oxidase inhibitors. J Med Chem 56:3582-92 (2013)  
Target
Name:
D-amino-acid oxidase
Synonyms:
D-amino-acid oxidase (DAAO) DAMOX OXDA_HUMAN
Type:
Homodimer
Mol. Mass.:
39476.06
Organism:
Homo sapiens (Human)
Description:
P14920
Residue:
347
  
Inhibitor
Name:
BDBM50260725
Synonyms:
4H-thieno[3,2-b]pyrrole-5-carboxylic acid | CHEMBL507614
Type:
Small organic molecule
Emp. Form.:
C7H5NO2S
Mol. Mass.:
167.185
SMILES:
OC(=O)c1cc2sccc2[nH]1
: