Target
Ribosomal protein S6 kinase alpha-3
Ligand
BDBM50431814
Substrate
Meas. Tech.
ChEMBL_952201 (CHEMBL2350997)
IC50
1510±n/a nM
Citation
 Zhong, YXue, MZhao, XYuan, JLiu, XHuang, JZhao, ZLi, HXu, Y Substituted indolin-2-ones as p90 ribosomal S6 protein kinase 2 (RSK2) inhibitors: Molecular docking simulation and structure-activity relationship analysis. Bioorg Med Chem 21:1724-34 (2013)  
Target
Name:
Ribosomal protein S6 kinase alpha-3
Synonyms:
90 kDa ribosomal protein S6 kinase 3 ISPK1 MAP kinase-activated protein kinase 1b RPS6KA3 RSK2 Ribosomal protein S6 kinase Ribosomal protein S6 kinase alpha-3 (RSK2) S6K-alpha 3 p90 ribosomal s6 kinase (RSK2) p90RSK | pp90RSK2
Type:
Serine/threonine-protein kinase
Mol. Mass.:
83740.03
Organism:
Homo sapiens (Human)
Description:
The human RSK2 sequence differed from the Genbank entry NM_004586 at one residue, V45G. The protein was cloned and purified from baculovirus expression system.
Residue:
740
  
Inhibitor
Name:
BDBM50431814
Synonyms:
CHEMBL2347075
Type:
Small organic molecule
Emp. Form.:
C13H8BrNO2
Mol. Mass.:
290.112
SMILES:
Brc1ccc2NC(=O)\C(=C\c3ccco3)c2c1
: