Target
Serine/threonine-protein kinase pim-1
Ligand
BDBM50431812
Substrate
Meas. Tech.
ChEMBL_952147 (CHEMBL2350674)
IC50
54±n/a nM
Citation
 Zhong, YXue, MZhao, XYuan, JLiu, XHuang, JZhao, ZLi, HXu, Y Substituted indolin-2-ones as p90 ribosomal S6 protein kinase 2 (RSK2) inhibitors: Molecular docking simulation and structure-activity relationship analysis. Bioorg Med Chem 21:1724-34 (2013)  
Target
Name:
Serine/threonine-protein kinase pim-1
Synonyms:
PIM-1 Kinase PIM1_HUMAN Serine/threonine-protein kinase (PIM1) Serine/threonine-protein kinase PIM1 | Serine/threonine-protein kinase pim-1 (PIM1)
Type:
Protein
Mol. Mass.:
35681.82
Organism:
Homo sapiens (Human)
Description:
P11309
Residue:
313
  
Inhibitor
Name:
BDBM50431812
Synonyms:
CHEMBL2347053
Type:
Small organic molecule
Emp. Form.:
C18H12N4O3
Mol. Mass.:
332.3129
SMILES:
[O-][N+](=O)c1ccccc1-c1n[nH]cc1C=C1C(=O)Nc2ccccc12
: