Target
3-hydroxy-3-methylglutaryl-coenzyme A reductase
Ligand
BDBM50432560
Substrate
Meas. Tech.
ChEMBL_950482 (CHEMBL2351234)
IC50
7900±n/a nM
Citation
 Chen, JBChern, TRWei, TTChen, CCLin, JHFang, JM Design and synthesis of dual-action inhibitors targeting histone deacetylases and 3-hydroxy-3-methylglutaryl coenzyme A reductase for cancer treatment. J Med Chem 56:3645-55 (2013)  
Target
Name:
3-hydroxy-3-methylglutaryl-coenzyme A reductase
Synonyms:
3-hydroxy-3-methylglutaryl-coenzyme A (HMG-CoA) reductase HMDH_HUMAN HMG-CoA reductase (HMGR) | HMGCR
Type:
Enzyme
Mol. Mass.:
97477.10
Organism:
Homo sapiens (Human)
Description:
P04035
Residue:
888
  
Inhibitor
Name:
BDBM50432560
Synonyms:
CHEMBL2347007 | US9353061, Simva-HA (2)
Type:
Small organic molecule
Emp. Form.:
C25H41NO6
Mol. Mass.:
451.5961
SMILES:
CCC(C)(C)C(=O)O[C@H]1C[C@@H](C)C=C2C=C[C@H](C)[C@H](CC[C@@H](O)C[C@@H](O)CC(=O)NO)[C@@H]12
: