Target
Cannabinoid receptor 2
Ligand
BDBM50432723
Substrate
Meas. Tech.
ChEMBL_952581 (CHEMBL2354094)
Ki
11±n/a nM
Citation
 Thakur, GABajaj, SParonis, CPeng, YBowman, ALBarak, LSCaron, MGParrish, DDeschamps, JRMakriyannis, A Novel adamantyl cannabinoids as CB1 receptor probes. J Med Chem 56:3904-21 (2013)  
Target
Name:
Cannabinoid receptor 2
Synonyms:
CANNABINOID CB2 CB2 CB2B CNR2_HUMAN Cannabinoid CB2 receptor Cannabinoid receptor 2 (CB2R) | hCB2
Type:
G Protein-Coupled Receptor (GPCR)
Mol. Mass.:
39690.94
Organism:
Homo sapiens (Human)
Description:
P34972
Residue:
360
  
Inhibitor
Name:
BDBM50432723
Synonyms:
CHEMBL2348466
Type:
Small organic molecule
Emp. Form.:
C27H36O3
Mol. Mass.:
408.5729
SMILES:
CC1(C)Oc2cc(cc(O)c2[C@@H]2C[C@H](CC=O)CC[C@@H]12)C12CC3CC(CC(C3)C1)C2
: