Target
E3 ubiquitin-protein ligase XIAP
Ligand
BDBM50432762
Substrate
Meas. Tech.
ChEMBL_952938 (CHEMBL2351927)
Ki
1.7±n/a nM
Citation
 Sheng, RSun, HLiu, LLu, JMcEachern, DWang, GWen, JMin, PDu, ZLu, HKang, SGuo, MYang, DWang, S A potent bivalent Smac mimetic (SM-1200) achieving rapid, complete, and durable tumor regression in mice. J Med Chem 56:3969-79 (2013)  
Target
Name:
E3 ubiquitin-protein ligase XIAP
Synonyms:
API3 E3 ubiquitin-protein ligase XIAP Inhibitor of apoptosis protein 3 X-linked inhibitor of apoptosis XIAP | XIAP_HUMAN
Type:
Protein
Mol. Mass.:
56685.27
Organism:
Homo sapiens (Human)
Description:
P98170
Residue:
497
  
Inhibitor
Name:
BDBM50432762
Synonyms:
CHEMBL2348622
Type:
Small organic molecule
Emp. Form.:
C62H74N12O8
Mol. Mass.:
1115.3266
SMILES:
CN[C@@H](C)C(=O)N[C@H]1CN(CC[C@H]2CC[C@H](N2C1=O)C(=O)NC(c1ccccc1)c1ccccc1)C(=O)Nc1cccc(NC(=O)N2CC[C@H]3CC[C@H](N3C(=O)[C@H](C2)NC(=O)[C@H](C)NC)C(=O)NC(c2ccccc2)c2ccccc2)c1
: