Target
Tyrosine-protein kinase JAK1
Ligand
BDBM50433242
Substrate
Meas. Tech.
ChEMBL_957631 (CHEMBL2378514)
IC50
5.5±n/a nM
Citation
 Lynch, SMDeVicente, JHermann, JCJaime-Figueroa, SJin, SKuglstatter, ALi, HLovey, AMenke, JNiu, LPatel, VRoy, DSoth, MSteiner, STivitmahaisoon, PVu, MDYee, C Strategic use of conformational bias and structure based design to identify potent JAK3 inhibitors with improved selectivity against the JAK family and the kinome. Bioorg Med Chem Lett 23:2793-800 (2013)  
Target
Name:
Tyrosine-protein kinase JAK1
Synonyms:
JAK-1 JAK1A JAK1_HUMAN Janus kinase 1 (JAK1) | Janus kinase 1 JAK1
Type:
Protein
Mol. Mass.:
133293.73
Organism:
Homo sapiens (Human)
Description:
P23458
Residue:
1154
  
Inhibitor
Name:
BDBM50433242
Synonyms:
CHEMBL2376155
Type:
Small organic molecule
Emp. Form.:
C25H25ClN8O2
Mol. Mass.:
504.971
SMILES:
Cn1nc(-c2cnc3[nH]cc(C(=O)N[C@@H](C(=O)N4CC(C4)C#N)C(C)(C)C)c3n2)c2ccc(Cl)cc12
: