Target
Tyrosine-protein kinase JAK1
Ligand
BDBM50433249
Substrate
Meas. Tech.
ChEMBL_957631 (CHEMBL2378514)
IC50
17±n/a nM
Citation
 Lynch, SMDeVicente, JHermann, JCJaime-Figueroa, SJin, SKuglstatter, ALi, HLovey, AMenke, JNiu, LPatel, VRoy, DSoth, MSteiner, STivitmahaisoon, PVu, MDYee, C Strategic use of conformational bias and structure based design to identify potent JAK3 inhibitors with improved selectivity against the JAK family and the kinome. Bioorg Med Chem Lett 23:2793-800 (2013)  
Target
Name:
Tyrosine-protein kinase JAK1
Synonyms:
JAK-1 JAK1A JAK1_HUMAN Janus kinase 1 (JAK1) | Janus kinase 1 JAK1
Type:
Protein
Mol. Mass.:
133293.73
Organism:
Homo sapiens (Human)
Description:
P23458
Residue:
1154
  
Inhibitor
Name:
BDBM50433249
Synonyms:
CHEMBL2376147
Type:
Small organic molecule
Emp. Form.:
C22H19FN8O2
Mol. Mass.:
446.4371
SMILES:
C[C@@H](NC(=O)c1c[nH]c2ncc(nc12)-c1nn(C)c2cc(F)ccc12)C(=O)N1CC(C1)C#N
: