Target
Diacylglycerol O-acyltransferase 1
Ligand
BDBM50433270
Substrate
Meas. Tech.
ChEMBL_957845 (CHEMBL2378958)
IC50
>10000±n/a nM
Citation
 Barlind, JGBuckett, LKCrosby, SGDavidsson, ÖEmtenäs, HErtan, AJurva, ULemurell, MGutierrez, PMNilsson, KO'Mahony, GPetersson, AURedzic, AWågberg, FYuan, ZQ Identification and design of a novel series of MGAT2 inhibitors. Bioorg Med Chem Lett 23:2721-6 (2013)  
Target
Name:
Diacylglycerol O-acyltransferase 1
Synonyms:
ACAT-related gene product 1 Acyl coA-diacylglycerol acyl transferase 1 (DGAT1) DGAT1 Diacylglycerol Acyltransferase (DGAT1) Diacylglycerol O-acyltransferase 1 (DGAT1) | Diglyceride acyltransferase
Type:
Protein
Mol. Mass.:
55297.82
Organism:
Homo sapiens (Human)
Description:
O75907
Residue:
488
  
Inhibitor
Name:
BDBM50433270
Synonyms:
CHEMBL2376329
Type:
Small organic molecule
Emp. Form.:
C19H21N3O5S
Mol. Mass.:
403.452
SMILES:
CCC1(C)NC(=O)c2cc(ccc2NC1=O)S(=O)(=O)Nc1ccc(OC)cc1
: