Target
Tyrosine-protein kinase JAK2
Ligand
BDBM50193995
Substrate
Meas. Tech.
ChEMBL_957864 (CHEMBL2378977)
IC50
4.0±n/a nM
Citation
 Jaime-Figueroa, SDe Vicente, JHermann, JJahangir, AJin, SKuglstatter, ALynch, SMMenke, JNiu, LPatel, VShao, ASoth, MVu, MDYee, C Discovery of a series of novel 5H-pyrrolo[2,3-b]pyrazine-2-phenyl ethers, as potent JAK3 kinase inhibitors. Bioorg Med Chem Lett 23:2522-6 (2013)  
Target
Name:
Tyrosine-protein kinase JAK2
Synonyms:
JAK-2 JAK2_HUMAN Janus kinase 2 (JAK2) | Janus kinase 2 (a protein tyrosine kinase)
Type:
Protein
Mol. Mass.:
130684.68
Organism:
Homo sapiens (Human)
Description:
O60674
Residue:
1132
  
Inhibitor
Name:
BDBM50193995
Synonyms:
3-((3R,4R)-4-methyl-3-(methyl(7H-pyrrolo[2,3-d]pyrimidin-4-yl)amino)piperidin-1-yl)-3-oxopropanenitrile 3-{(3R,4R)-4-methyl-3-[methyl(7H-pyrrolo[2,3-d]pyrimidin-4-yl)amino]piperidin-1-yl}-3-oxopropanenitrile CP-690550 Tofacitinib US10112907, Example 00035 US10766894, Compound TABLE 1.20 US11078206, Example Tofacitinib US11339167, Example Tofacitinib
Type:
Small organic molecule
Emp. Form.:
C16H20N6O
Mol. Mass.:
312.3696
SMILES:
C[C@@H]1CCN(C[C@@H]1N(C)c1ncnc2[nH]ccc12)C(=O)CC#N
: