Target
Muscarinic acetylcholine receptor M5
Ligand
BDBM50433574
Substrate
Meas. Tech.
ChEMBL_960031 (CHEMBL2384201)
EC50
4.6±n/a nM
Citation
 Gentry, PRBridges, TMLamsal, AVinson, PNSmith, EChase, PHodder, PSEngers, JLNiswender, CMDaniels, JSJeffrey Conn, PWood, MRLindsley, CW Discovery of ML326: The first sub-micromolar, selective M5 PAM. Bioorg Med Chem Lett 23:2996-3000 (2013)  
Target
Name:
Muscarinic acetylcholine receptor M5
Synonyms:
ACM5_RAT Chrm-5 Muscarinic acetylcholine receptor | Muscarinic acetylcholine receptor M5
Type:
Enzyme Catalytic Domain
Mol. Mass.:
60161.80
Organism:
RAT
Description:
Cholinergic, muscarinic M5 CHRM5 RAT::P08911
Residue:
531
  
Inhibitor
Name:
BDBM50433574
Synonyms:
CHEMBL2381694
Type:
Small organic molecule
Emp. Form.:
C17H12F3NO4
Mol. Mass.:
351.2767
SMILES:
FC(F)(F)Oc1ccc2N(CCOc3ccccc3)C(=O)C(=O)c2c1
: