Target
Dihydrofolate reductase
Ligand
BDBM50433811
Substrate
Meas. Tech.
ChEMBL_959374 (CHEMBL2384165)
IC50
52±n/a nM
Citation
 Gangjee, ANamjoshi, OARaghavan, SQueener, SFKisliuk, RLCody, V Design, synthesis, and molecular modeling of novel pyrido[2,3-d]pyrimidine analogues as antifolates; application of Buchwald-Hartwig aminations of heterocycles. J Med Chem 56:4422-41 (2013)  
Target
Name:
Dihydrofolate reductase
Synonyms:
DHFR Dihydrofolate reductase (DHFR) | Tetrahydrofolate dehydrogenase
Type:
Enzyme
Mol. Mass.:
21453.99
Organism:
Homo sapiens (Human)
Description:
Recombinant human DHFR.
Residue:
187
  
Inhibitor
Name:
BDBM50433811
Synonyms:
CHEMBL2382332
Type:
Small organic molecule
Emp. Form.:
C17H20N6
Mol. Mass.:
308.3809
SMILES:
CC(C)c1ccc(cc1)N(C)c1cnc2nc(N)nc(N)c2c1
: