Target
5'-AMP-activated protein kinase catalytic subunit alpha-1
Ligand
BDBM50434272
Substrate
Meas. Tech.
ChEMBL_961308 (CHEMBL2390484)
EC50
9000±n/a nM
Citation
 Yu, LFLi, YYSu, MBZhang, MZhang, WZhang, LNPang, TZhang, RTLiu, BLi, JYLi, JNan, FJ Development of Novel Alkene Oxindole Derivatives As Orally Efficacious AMP-Activated Protein Kinase Activators. ACS Med Chem Lett 4:475-80 (2013)  
Target
Name:
5'-AMP-activated protein kinase catalytic subunit alpha-1
Synonyms:
AAPK1_HUMAN AMP-activated protein kinase alpha-1/beta-2/gamma-2 AMPK subunit alpha-1 AMPK1 PRKAA1 | Tau-protein kinase PRKAA1
Type:
Protein
Mol. Mass.:
64023.62
Organism:
Homo sapiens (Human)
Description:
Q13131
Residue:
559
  
Inhibitor
Name:
BDBM50434272
Synonyms:
CHEMBL1242297
Type:
Small organic molecule
Emp. Form.:
C23H16ClN3O6S
Mol. Mass.:
497.908
SMILES:
Cc1cc(-c2ccc(\C=C3/S\C(NC3=O)=N/c3ccc(Cl)c(c3)C(O)=O)o2)c(cc1C)[N+]([O-])=O
: