Target
Dual specificity tyrosine-phosphorylation-regulated kinase 1B
Ligand
BDBM50434360
Substrate
Meas. Tech.
ChEMBL_961004 (CHEMBL2388920)
IC50
64±n/a nM
Citation
 Rosse, G Tricyclic Pyrimidines As Inhibitors of DYRK1A/DYRK1B As Potential Treatment for Down's Syndrome or Alzheimer's Disease. ACS Med Chem Lett 4:502-3 (2013)  
Target
Name:
Dual specificity tyrosine-phosphorylation-regulated kinase 1B
Synonyms:
DYR1B_HUMAN Dual specificity tyrosine-phosphorylation-regulated kinase 1B MIRK
Type:
Enzyme
Mol. Mass.:
69222.24
Organism:
Homo sapiens (Human)
Description:
Q9Y463
Residue:
629
  
Inhibitor
Name:
BDBM50434360
Synonyms:
CHEMBL2386768 | US9446044, 76
Type:
Small organic molecule
Emp. Form.:
C19H18N6OS
Mol. Mass.:
378.451
SMILES:
COC(=N)c1nc2ccc3ncnc(Nc4ccc(cc4)N(C)C)c3c2s1
: