Target
Proteasome subunit beta type-5
Ligand
BDBM50434760
Substrate
Meas. Tech.
ChEMBL_962205 (CHEMBL2388793)
Ki
1620±n/a nM
Citation
 Micale, NEttari, RLavecchia, ADi Giovanni, CScarbaci, KTroiano, VGrasso, SNovellino, ESchirmeister, TZappalà, M Development of peptidomimetic boronates as proteasome inhibitors. Eur J Med Chem 64:23-34 (2013)  
Target
Name:
Proteasome subunit beta type-5
Synonyms:
20S proteasome chymotrypsin-like LMPX PSB5_HUMAN Proteasome Macropain subunit MB1 X
Type:
Protein
Mol. Mass.:
28480.96
Organism:
Homo sapiens (Human)
Description:
Residue:
263
  
Inhibitor
Name:
BDBM50434760
Synonyms:
CHEMBL2385820
Type:
Small organic molecule
Emp. Form.:
C16H26BN3O4
Mol. Mass.:
335.206
SMILES:
CC(C)C[C@H](NC(=O)Cn1ccc2N(C)CCCc2c1=O)B(O)O
: