Target
Proteasome subunit beta type-5
Ligand
BDBM50434769
Substrate
Meas. Tech.
ChEMBL_962205 (CHEMBL2388793)
Ki
5900±n/a nM
Citation
 Micale, NEttari, RLavecchia, ADi Giovanni, CScarbaci, KTroiano, VGrasso, SNovellino, ESchirmeister, TZappalà, M Development of peptidomimetic boronates as proteasome inhibitors. Eur J Med Chem 64:23-34 (2013)  
Target
Name:
Proteasome subunit beta type-5
Synonyms:
20S proteasome chymotrypsin-like LMPX PSB5_HUMAN Proteasome Macropain subunit MB1 X
Type:
Protein
Mol. Mass.:
28480.96
Organism:
Homo sapiens (Human)
Description:
Residue:
263
  
Inhibitor
Name:
BDBM50434769
Synonyms:
CHEMBL2385816
Type:
Small organic molecule
Emp. Form.:
C19H31BN4O4
Mol. Mass.:
390.285
SMILES:
CC(C)C[C@H](NC(=O)Cn1ccc(cc1=O)N1CCN(CC=C)CC1)B(O)O
: