Target
Gamma-aminobutyric acid type B receptor subunit 1
Ligand
BDBM50435128
Substrate
Meas. Tech.
ChEMBL_965462 (CHEMBL2395266)
Ki
2.9±n/a nM
Citation
 Germain, ARCarmody, LCNag, PPMorgan, BVerplank, LFernandez, CDonckele, EFeng, YPerez, JRDandapani, SPalmer, MLander, ESGupta, PBSchreiber, SLMunoz, B Cinnamides as selective small-molecule inhibitors of a cellular model of breast cancer stem cells. Bioorg Med Chem Lett 23:1834-8 (2013)  
Target
Name:
Gamma-aminobutyric acid type B receptor subunit 1
Synonyms:
GABA-B receptor GABA-B-R1 GABBR1 GARABR1 Gb1
Type:
Enzyme Catalytic Domain
Mol. Mass.:
108337.22
Organism:
Homo sapiens (Human)
Description:
Q9UBS5
Residue:
961
  
Inhibitor
Name:
BDBM50435128
Synonyms:
CHEMBL2391908
Type:
Small organic molecule
Emp. Form.:
C18H28Cl2NO3P
Mol. Mass.:
408.3
SMILES:
C[C@H](NCC(=O)CP(O)(O)CC1CCCCC1)c1ccc(Cl)c(Cl)c1
: