Target
Isocitrate lyase
Ligand
BDBM50274515
Substrate
Meas. Tech.
ChEMBL_972063 (CHEMBL2406167)
IC50
13910±n/a nM
Citation
 Ahn, CHWon, THKim, HShin, JOh, KB Inhibition of Candida albicans isocitrate lyase activity by cadiolides and synoilides from the ascidian Synoicum sp. Bioorg Med Chem Lett 23:4099-101 (2013)  
Target
Name:
Isocitrate lyase
Synonyms:
ACEA_CANAX | ICL1
Type:
PROTEIN
Mol. Mass.:
61398.95
Organism:
Candida albicans
Description:
ChEMBL_972063
Residue:
550
  
Inhibitor
Name:
BDBM50274515
Synonyms:
3-nitropropanoic acid Bovinocidin CHEMBL451226
Type:
Small organic molecule
Emp. Form.:
C3H4NO4
Mol. Mass.:
118.0687
SMILES:
[O-]C(=O)CC[N+]([O-])=O
: