Target
11-beta-hydroxysteroid dehydrogenase 1
Ligand
BDBM50239401
Substrate
Meas. Tech.
ChEMBL_971351 (CHEMBL2405914)
IC50
97±n/a nM
Citation
 Deng, XShen, YYang, JHe, JZhao, YPeng, LYLeng, YZhao, QS Discovery and structure-activity relationships of ent-Kaurene diterpenoids as potent and selective 11ß-HSD1 inhibitors: potential impact in diabetes. Eur J Med Chem 65:403-14 (2013)  
Target
Name:
11-beta-hydroxysteroid dehydrogenase 1
Synonyms:
11-DH 11-beta-Hydroxysteroid Dehydrogenase 1 (11-beta-HSD1) 11beta-HSD1A Corticosteroid 11-beta-dehydrogenase isozyme 1 (11-beta-HSD-1) Hsd11 | Hsd11b1
Type:
Enzyme
Mol. Mass.:
32369.70
Organism:
Mus musculus (mouse)
Description:
P50172
Residue:
292
  
Inhibitor
Name:
BDBM50239401
Synonyms:
3-Adamantan-1-yl-6,7,8,9-tetrahydro-5H-[1,2,4]triazolo[4,3-a]azepine MERCK-544
Type:
Small organic molecule
Emp. Form.:
C17H25N3
Mol. Mass.:
271.4005
SMILES:
C1C2CC3CC1CC(C2)(C3)c1nnc2CCCCCn12
: