Target
Glyceraldehyde-3-phosphate dehydrogenase, glycosomal
Ligand
BDBM50438273
Substrate
Meas. Tech.
ChEMBL_973313 (CHEMBL2412700)
Ki
29530±n/a nM
Citation
 Soares, FASesti-Costa, Rda Silva, JSde Souza, MCFerreira, VFSantos, Fda CMonteiro, PALeitão, AMontanari, CA Molecular design, synthesis and biological evaluation of 1,4-dihydro-4-oxoquinoline ribonucleosides as TcGAPDH inhibitors with trypanocidal activity. Bioorg Med Chem Lett 23:4597-601 (2013)  
Target
Name:
Glyceraldehyde-3-phosphate dehydrogenase, glycosomal
Synonyms:
G3PG_TRYCR
Type:
PROTEIN
Mol. Mass.:
39070.68
Organism:
Trypanosoma cruzi
Description:
ChEMBL_973242
Residue:
359
  
Inhibitor
Name:
BDBM50438273
Synonyms:
CHEMBL2408384
Type:
Small organic molecule
Emp. Form.:
C15H14BrNO7
Mol. Mass.:
400.178
SMILES:
OC[C@H]1O[C@H]([C@H](O)[C@@H]1O)n1cc(C(O)=O)c(=O)c2cc(Br)ccc12
: