Target
Acidic mammalian chitinase
Ligand
BDBM50438378
Substrate
Meas. Tech.
ChEMBL_976716 (CHEMBL2417154)
IC50
4000±n/a nM
Citation
 Wakasugi, MGouda, HHirose, TSugawara, AYamamoto, TShiomi, KSunazuka, TOmura, SHirono, S Human acidic mammalian chitinase as a novel target for anti-asthma drug design using in silico screening. Bioorg Med Chem 21:3214-20 (2013)  
Target
Name:
Acidic mammalian chitinase
Synonyms:
AMCase CHIA Lung-specific protein TSA1902
Type:
Protein
Mol. Mass.:
52266.66
Organism:
Homo sapiens (Human)
Description:
Q9BZP6
Residue:
476
  
Inhibitor
Name:
BDBM50438378
Synonyms:
CHEMBL2413400
Type:
Small organic molecule
Emp. Form.:
C19H21N5O2S
Mol. Mass.:
383.467
SMILES:
CN(C)c1ccc(C=C(NC(=O)c2ccccc2)C(=O)NNC(N)=S)cc1
: