Target
D(2) dopamine receptor
Ligand
BDBM50438565
Substrate
Meas. Tech.
ChEMBL_977143 (CHEMBL2416736)
Ki
37±n/a nM
Citation
 Majo, VJMilak, MSPrabhakaran, JMali, PSavenkova, LSimpson, NRMann, JJParsey, RVKumar, JS Synthesis and in vivo evaluation of [(18)F]2-(4-(4-(2-(2-fluoroethoxy)phenyl)piperazin-1-yl)butyl)-4-methyl-1,2,4-triazine-3,5(2H,4H)-dione ([(18)F]FECUMI-101) as an imaging probe for 5-HT1A receptor agonist in nonhuman primates. Bioorg Med Chem 21:5598-604 (2013)  
Target
Name:
D(2) dopamine receptor
Synonyms:
D(2) dopamine receptor DOPAMINE D2 Long DRD2 Dopamine D2 receptor Dopamine D2 receptor (D2R) Dopamine2-like | d2
Type:
Cell-surface receptors
Mol. Mass.:
50647.10
Organism:
Homo sapiens (Human)
Description:
P14416
Residue:
443
  
Inhibitor
Name:
BDBM50438565
Synonyms:
CHEMBL2413153
Type:
Small organic molecule
Emp. Form.:
C20H28FN5O3
Mol. Mass.:
405.4664
SMILES:
Cn1c(=O)cnn(CCCCN2CCN(CC2)c2ccccc2OCCF)c1=O
: