Target
Tyrosine-protein kinase ABL1
Ligand
BDBM12985
Substrate
Meas. Tech.
ChEMBL_979932 (CHEMBL2422665)
IC50
7.9±n/a nM
Citation
 Gao, CCahya, SNicolaou, CAWang, JWatson, IACummins, DJIversen, PWVieth, M Selectivity data: assessment, predictions, concordance, and implications. J Med Chem 56:6991-7002 (2013)  
Target
Name:
Tyrosine-protein kinase ABL1
Synonyms:
ABL ABL1_HUMAN JTK7 Proto-oncogene tyrosine-protein kinase ABL1 Tyrosine-protein kinase ABL V-abl Abelson murine leukemia viral oncogene homolog 1 p150 | tyrosine-protein kinase ABL1 isoform a
Type:
Enzyme
Mol. Mass.:
122897.30
Organism:
Homo sapiens (Human)
Description:
P00519
Residue:
1130
  
Inhibitor
Name:
BDBM12985
Synonyms:
5-Amido-pyrrolopyrazole 9d N-{5-[(2R)-2-methoxy-2-phenylacetyl]-1H,4H,5H,6H-pyrrolo[3,4-c]pyrazol-3-yl}-4-(4-methylpiperazin-1-yl)benzamide
Type:
Small organic molecule
Emp. Form.:
C26H30N6O3
Mol. Mass.:
474.5548
SMILES:
CO[C@@H](C(=O)N1Cc2n[nH]c(NC(=O)c3ccc(cc3)N3CCN(C)CC3)c2C1)c1ccccc1
: