Target
Cyclin-dependent kinase 9
Ligand
BDBM50439561
Substrate
Meas. Tech.
ChEMBL_979939 (CHEMBL2422672)
IC50
10.0±n/a nM
Citation
 Gao, CCahya, SNicolaou, CAWang, JWatson, IACummins, DJIversen, PWVieth, M Selectivity data: assessment, predictions, concordance, and implications. J Med Chem 56:6991-7002 (2013)  
Target
Name:
Cyclin-dependent kinase 9
Synonyms:
C-2K CDK9 Cell division cycle 2-like protein kinase 4 Cyclin-Dependent Kinase 9 (CDK9) Serine/threonine-protein kinase PITALRE Tat-associated kinase complex catalytic subunit
Type:
Enzyme Subunit
Mol. Mass.:
42789.13
Organism:
Homo sapiens (Human)
Description:
Residue:
372
  
Inhibitor
Name:
BDBM50439561
Synonyms:
CHEMBL1965660 | US9670191, F26
Type:
Small organic molecule
Emp. Form.:
C15H11Cl2N5O
Mol. Mass.:
348.187
SMILES:
NC(=O)c1cc([nH]c1-c1ccc(Cl)cc1Cl)-c1ccnc(N)n1
: