Target
Poly [ADP-ribose] polymerase 2
Ligand
BDBM50439791
Substrate
Meas. Tech.
ChEMBL_977442 (CHEMBL2422477)
IC50
32000±n/a nM
Citation
 Shultz, MDCheung, AKKirby, CAFirestone, BFan, JChen, CHChen, ZChin, DNDipietro, LFazal, AFeng, YFortin, PDGould, TLagu, BLei, HLenoir, FMajumdar, DOchala, EPalermo, MGPham, LPu, MSmith, TStams, TTomlinson, RCTouré, BBVisser, MWang, RMWaters, NJShao, W Identification of NVP-TNKS656: the use of structure-efficiency relationships to generate a highly potent, selective, and orally active tankyrase inhibitor. J Med Chem 56:6495-511 (2013)  
Target
Name:
Poly [ADP-ribose] polymerase 2
Synonyms:
(ARTD2 or PARP2) ADPRTL2 PARP2_HUMAN Poly [ADP-ribose] polymerase 2 (PARP2)
Type:
Enzyme
Mol. Mass.:
66225.70
Organism:
Homo sapiens (Human)
Description:
Q9UGN5
Residue:
583
  
Inhibitor
Name:
BDBM50439791
Synonyms:
CHEMBL2419706 | US9181266, 5
Type:
Small organic molecule
Emp. Form.:
C27H34N4O5
Mol. Mass.:
494.5827
SMILES:
COc1ccc(cc1)C(=O)C1CCN(CC(=O)N(CC2CC2)Cc2nc3CCOCc3c(=O)[nH]2)CC1
: