Target
G-protein coupled receptor 35
Ligand
BDBM50436029
Substrate
Meas. Tech.
ChEMBL_982934 (CHEMBL2429574)
Ki
198±n/a nM
Citation
 Thimm, DFunke, MMeyer, AMüller, CE 6-Bromo-8-(4-[(3)H]methoxybenzamido)-4-oxo-4H-chromene-2-carboxylic Acid: a powerful tool for studying orphan G protein-coupled receptor GPR35. J Med Chem 56:7084-99 (2013)  
Target
Name:
G-protein coupled receptor 35
Synonyms:
G protein-coupled receptor 35 GPR35_HUMAN
Type:
Enzyme Catalytic Domain
Mol. Mass.:
34085.57
Organism:
Homo sapiens (Human)
Description:
gi_33695097
Residue:
309
  
Inhibitor
Name:
BDBM50436029
Synonyms:
CHEMBL2392163
Type:
Small organic molecule
Emp. Form.:
C20H16FNO6
Mol. Mass.:
385.3425
SMILES:
CCOC(=O)c1cc(=O)c2cc(F)cc(NC(=O)c3ccc(OC)cc3)c2o1
: