Target
Lysine-specific demethylase 5A
Ligand
BDBM50440286
Substrate
Meas. Tech.
ChEMBL_982482 (CHEMBL2427608)
IC50
55000±n/a nM
Citation
 Suzuki, TOzasa, HItoh, YZhan, PSawada, HMino, KWalport, LOhkubo, RKawamura, AYonezawa, MTsukada, YTumber, ANakagawa, HHasegawa, MSasaki, RMizukami, TSchofield, CJMiyata, N Identification of the KDM2/7 histone lysine demethylase subfamily inhibitor and its antiproliferative activity. J Med Chem 56:7222-31 (2013)  
Target
Name:
Lysine-specific demethylase 5A
Synonyms:
Histone demethylase JARID1A Jumonji/ARID domain-containing protein 1A KDM5A_HUMAN RBBP-2 RBP2 | Retinoblastoma-binding protein 2
Type:
Protein
Mol. Mass.:
192091.79
Organism:
Homo sapiens (Human)
Description:
P29375
Residue:
1690
  
Inhibitor
Name:
BDBM50440286
Synonyms:
CHEMBL2424815
Type:
Small organic molecule
Emp. Form.:
C19H35NO4
Mol. Mass.:
341.4855
SMILES:
ON(CCC(O)=O)C(=O)CCCCCCCCC1CCCCCC1
: