Target
Lethal(3)malignant brain tumor-like protein 3
Ligand
BDBM50440567
Substrate
Meas. Tech.
ChEMBL_983409 (CHEMBL2429079)
IC50
160±n/a nM
Citation
 James, LIKorboukh, VKKrichevsky, LBaughman, BMHerold, JMNorris, JLJin, JKireev, DBJanzen, WPArrowsmith, CHFrye, SV Small-molecule ligands of methyl-lysine binding proteins: optimization of selectivity for L3MBTL3. J Med Chem 56:7358-71 (2013)  
Target
Name:
Lethal(3)malignant brain tumor-like protein 3
Synonyms:
H-l(3)mbt-like protein 3 L(3)mbt-like protein 3 LMBL3_HUMAN Lethal(3)malignant brain tumor-like protein 3 (L3MBTL3) MBT1
Type:
Protein
Mol. Mass.:
88334.17
Organism:
Homo sapiens (Human)
Description:
Residue:
780
  
Inhibitor
Name:
BDBM50440567
Synonyms:
CHEMBL2426477
Type:
Small organic molecule
Emp. Form.:
C26H37N5O4
Mol. Mass.:
483.6031
SMILES:
[O-][N+](=O)c1cc(ccc1C(=O)N1CCC(CC1)N1CCCC1)C(=O)N1CCC(CC1)N1CCCC1
: