Target
Polyunsaturated fatty acid 5-lipoxygenase
Ligand
BDBM50042949
Substrate
Meas. Tech.
ChEMBL_985247 (CHEMBL2434497)
IC50
4.6±n/a nM
Citation
  TBA Med Chem Res 0:1-22 (2013)    Article 
Target
Name:
Polyunsaturated fatty acid 5-lipoxygenase
Synonyms:
Alox5 LOX5_RAT
Type:
PROTEIN
Mol. Mass.:
78082.31
Organism:
Rattus norvegicus
Description:
ChEMBL_1432947
Residue:
673
  
Inhibitor
Name:
BDBM50042949
Synonyms:
(E)-1-(2,4-dihydroxyphenyl)-3-(3,4-dihydroxyphenyl)-2-propen-1-one (21) (E)-3-(3,4-Dihydroxy-phenyl)-1-(2,4-dihydroxy-phenyl)-propenone 3-(3,4-Dihydroxy-phenyl)-1-(2,4-dihydroxy-phenyl)-propenone CHEMBL128000
Type:
Small organic molecule
Emp. Form.:
C15H12O5
Mol. Mass.:
272.2528
SMILES:
Oc1ccc(C(=O)\C=C\c2ccc(O)c(O)c2)c(O)c1
: