Target
Mitogen-activated protein kinase kinase kinase 11
Ligand
BDBM50441570
Substrate
Meas. Tech.
ChEMBL_986643 (CHEMBL2437703)
IC50
9.0±n/a nM
Citation
 Goodfellow, VSLoweth, CJRavula, SBWiemann, TNguyen, TXu, YTodd, DESheppard, DPollack, SPolesskaya, OMarker, DFDewhurst, SGelbard, HA Discovery, synthesis, and characterization of an orally bioavailable, brain penetrant inhibitor of mixed lineage kinase 3. J Med Chem 56:8032-48 (2013)  
Target
Name:
Mitogen-activated protein kinase kinase kinase 11
Synonyms:
M3K11_HUMAN MLK3 Mixed Lineage Kinase 3 (MLK3) SPRK
Type:
PROTEIN
Mol. Mass.:
92696.93
Organism:
Homo sapiens (Human)
Description:
ChEMBL_1460565
Residue:
847
  
Inhibitor
Name:
BDBM50441570
Synonyms:
CHEMBL2436976 US9814704, Example 17
Type:
Small organic molecule
Emp. Form.:
C20H19N5O3
Mol. Mass.:
377.3966
SMILES:
COc1cc(cc(OC)c1OC)-c1cnc2[nH]cc(-c3cnc(N)nc3)c2c1
: