Target
Tyrosine-protein kinase ITK/TSK
Ligand
BDBM50442142
Substrate
Meas. Tech.
ChEMBL_993112 (CHEMBL2446687)
Ki
0.200000±n/a nM
Citation
 Alder, CMAmbler, MCampbell, AJChampigny, ACDeakin, AMHarling, JDHarris, CALongstaff, TLynn, SMaxwell, ACMooney, CJScullion, CSingh, OMSmith, IESomers, DOTame, CJWayne, GWilson, CWoolven, JM Identification of a Novel and Selective Series of Itk Inhibitors via a Template-Hopping Strategy. ACS Med Chem Lett 4:948-52 (2013)  
Target
Name:
Tyrosine-protein kinase ITK/TSK
Synonyms:
EMT ITK_HUMAN LYK Tyrosine-protein kinase ITK Tyrosine-protein kinase Lyk
Type:
Protein
Mol. Mass.:
71839.20
Organism:
Homo sapiens (Human)
Description:
Q08881
Residue:
620
  
Inhibitor
Name:
BDBM50442142
Synonyms:
CHEMBL2441275
Type:
Small organic molecule
Emp. Form.:
C24H26N6O2S
Mol. Mass.:
462.567
SMILES:
COc1ccc2nc(Nc3cc(Cc4ccccc4)nc(N[C@H]4CC[C@H](O)CC4)n3)sc2n1
: