Target
Solute carrier organic anion transporter family member 1B3
Ligand
BDBM50442868
Substrate
Meas. Tech.
ChEMBL_1265867 (CHEMBL3039493)
Ki
450±n/a nM
Citation
 De Bruyn, Tvan Westen, GJIjzerman, APStieger, Bde Witte, PAugustijns, PFAnnaert, PP Structure-based identification of OATP1B1/3 inhibitors. Mol Pharmacol 83:1257-67 (2013)  
Target
Name:
Solute carrier organic anion transporter family member 1B3
Synonyms:
LST2 OATP8 SLC21A8 SO1B3_HUMAN Solute carrier organic anion transporter family member 1B3 (OATP1B3)
Type:
Protein
Mol. Mass.:
77425.75
Organism:
Homo sapiens (Human)
Description:
Q9NPD5
Residue:
702
  
Inhibitor
Name:
BDBM50442868
Synonyms:
Atorvastatin | Atorvastatin Calcium
Type:
Small organic molecule
Emp. Form.:
C66H68CaF2N4O10
Mol. Mass.:
1155.342
SMILES:
[Ca++].CC(C)c1c(C(=O)Nc2ccccc2)c(c(-c2ccc(F)cc2)n1CC[C@@H](O)C[C@@H](O)CC([O-])=O)-c1ccccc1.CC(C)c1c(C(=O)Nc2ccccc2)c(c(-c2ccc(F)cc2)n1CC[C@@H](O)C[C@@H](O)CC([O-])=O)-c1ccccc1
: