Target
Macrophage colony-stimulating factor 1 receptor
Ligand
BDBM50443168
Substrate
Meas. Tech.
ChEMBL_1276356 (CHEMBL3088374)
IC50
1.2±n/a nM
Citation
 Illig, CRManthey, CLMeegalla, SKWall, MJChen, JWilson, KJDesJarlais, RLBallentine, SKSchubert, CCrysler, CSChen, YMolloy, CJChaikin, MADonatelli, RRYurkow, EZhou, ZPlayer, MRTomczuk, BE Enhancement of kinase selectivity in a potent class of arylamide FMS inhibitors. Bioorg Med Chem Lett 23:6363-9 (2013)  
Target
Name:
Macrophage colony-stimulating factor 1 receptor
Synonyms:
CSF1R FMS Macrophage colony stimulating factor receptor Macrophage colony-stimulating factor 1 receptor (c-FMS) Proto-oncogene c-Fms c-fms | cFMS
Type:
Protein
Mol. Mass.:
107979.48
Organism:
Homo sapiens (Human)
Description:
P07333
Residue:
972
  
Inhibitor
Name:
BDBM50443168
Synonyms:
CHEMBL3085976 | US8674100, 24
Type:
Small organic molecule
Emp. Form.:
C28H38N6O2
Mol. Mass.:
490.6403
SMILES:
CC(C)(NCCN1CCOCC1)c1ccc(NC(=O)c2ncc([nH]2)C#N)c(c1)C1=CCC(C)(C)CC1
: