Target
Tyrosine-protein kinase ITK/TSK
Ligand
BDBM50443186
Substrate
Meas. Tech.
ChEMBL_1276382 (CHEMBL3088400)
Ki
30±n/a nM
Citation
 MacKinnon, CHLau, KBurch, JDChen, YDines, JDing, XEigenbrot, CHeifetz, AJaochico, AJohnson, AKraemer, JKruger, SKrülle, TMLiimatta, MLy, JMaghames, RMontalbetti, CAOrtwine, DFPérez-Fuertes, YShia, SStein, DBTrani, GVaidya, DGWang, XBromidge, SMWu, LCPei, Z Structure-based design and synthesis of potent benzothiazole inhibitors of interleukin-2 inducible T cell kinase (ITK). Bioorg Med Chem Lett 23:6331-5 (2013)  
Target
Name:
Tyrosine-protein kinase ITK/TSK
Synonyms:
EMT ITK_HUMAN LYK Tyrosine-protein kinase ITK Tyrosine-protein kinase Lyk
Type:
Protein
Mol. Mass.:
71839.20
Organism:
Homo sapiens (Human)
Description:
Q08881
Residue:
620
  
Inhibitor
Name:
BDBM50443186
Synonyms:
CHEMBL3086331
Type:
Small organic molecule
Emp. Form.:
C22H20N4O2S
Mol. Mass.:
404.485
SMILES:
COc1ccc(cc1)[C@H]1C[C@@H]1C(=O)Nc1nc2ccc(cc2s1)-c1cn[nH]c1C
: